Reaction Details
TargetSolute carrier family 15 member 1
LigandBDBM50162073
Substrate/Competitorn/a
Meas. Tech.ChEMBL_306462 (CHEMBL829539)
IC50 431000±n/a nM
Citation Song, XVig, BSLorenzi, PLDrach, JCTownsend, LBAmidon, GL Amino acid ester prodrugs of the antiviral agent 2-bromo-5,6-dichloro-1-(beta-D-ribofuranosyl)benzimidazole as potential substrates of hPEPT1 transporter. J Med Chem48:1274-7 (2005) 
 
Solute carrier family 15 member 1
Name:Solute carrier family 15 member 1
Type:PROTEIN
Mol. Mass.:78818.07
Organism:Homo sapiens (Human)
Description:ChEMBL_1488839
Residue:708
BDBM50162073
NameBDBM50162073
Synonyms:(S)-2-((2-amino-6-oxo-3H-purin-9(6H)-yl)methoxy)ethyl 2-amino-3-methylbutanoate CHEMBL1349 | VALACYCLOVIR
TypeSmall organic molecule
Emp. Form.C13H20N6O4
Mol. Mass.324.3357
SMILESCC(C)[C@H](N)C(=O)OCCOCn1cnc2c1nc(N)[nH]c2=O