Reaction Details
TargetCannabinoid receptor 2
LigandBDBM50163114
Substrate/Competitorn/a
Meas. Tech.ChEMBL_303175 (CHEMBL829669)
Ki 5444±n/a nM
Citation Lange, JHvan Stuivenberg, HHCoolen, HKAdolfs, TJMcCreary, ACKeizer, HGWals, HCVeerman, WBorst, AJde Looff, WVerveer, PCKruse, CG Bioisosteric replacements of the pyrazole moiety of rimonabant: synthesis, biological properties, and molecular modeling investigations of thiazoles, triazoles, and imidazoles as potent and selective CB1 cannabinoid receptor antagonists. J Med Chem48:1823-38 (2005) 
 
Cannabinoid receptor 2
Name:Cannabinoid receptor 2
Type:G Protein-Coupled Receptor (GPCR)
Mol. Mass.:39690.94
Organism:Homo sapiens (Human)
Description:P34972
Residue:360
BDBM50163114
NameBDBM50163114
Synonyms:5-(4-Chloro-phenyl)-1-(2,4-dichloro-phenyl)-1H-[1,2,4]triazole-3-carboxylic acid piperidin-1-ylamide; dihydrochloride | CHEMBL558564
TypeSmall organic molecule
Emp. Form.C20H18Cl3N5O
Mol. Mass.450.749
SMILESClc1ccc(cc1)-c1nc(nn1-c1ccc(Cl)cc1Cl)C(=O)NN1CCCCC1