Reaction Details
TargetCannabinoid receptor 1
LigandBDBM50163118
Substrate/Competitorn/a
Meas. Tech.ChEMBL_303193 (CHEMBL829819)
Ki 171±n/a nM
Citation Lange, JHvan Stuivenberg, HHCoolen, HKAdolfs, TJMcCreary, ACKeizer, HGWals, HCVeerman, WBorst, AJde Looff, WVerveer, PCKruse, CG Bioisosteric replacements of the pyrazole moiety of rimonabant: synthesis, biological properties, and molecular modeling investigations of thiazoles, triazoles, and imidazoles as potent and selective CB1 cannabinoid receptor antagonists. J Med Chem48:1823-38 (2005) 
 
Cannabinoid receptor 1
Name:Cannabinoid receptor 1
Type:G Protein-Coupled Receptor (GPCR)
Mol. Mass.:52868.96
Organism:Homo sapiens (Human)
Description:P21554
Residue:472
BDBM50163118
NameBDBM50163118
Synonyms:1-(4-Chloro-phenyl)-2-(2,4-dichloro-phenyl)-5-methyl-1H-imidazole-4-carboxylic acid 4-trifluoromethyl-benzylamide | CHEMBL178799
TypeSmall organic molecule
Emp. Form.C25H17Cl3F3N3O
Mol. Mass.538.776
SMILESCc1c(nc(-c2ccc(Cl)cc2Cl)n1-c1ccc(Cl)cc1)C(=O)NCc1ccc(cc1)C(F)(F)F