Reaction Details
TargetCannabinoid receptor 1
LigandBDBM50140232
Substrate/Competitorn/a
Meas. Tech.ChEMBL_303193 (CHEMBL829819)
Ki 40±n/a nM
Citation Lange, JHvan Stuivenberg, HHCoolen, HKAdolfs, TJMcCreary, ACKeizer, HGWals, HCVeerman, WBorst, AJde Looff, WVerveer, PCKruse, CG Bioisosteric replacements of the pyrazole moiety of rimonabant: synthesis, biological properties, and molecular modeling investigations of thiazoles, triazoles, and imidazoles as potent and selective CB1 cannabinoid receptor antagonists. J Med Chem48:1823-38 (2005) 
 
Cannabinoid receptor 1
Name:Cannabinoid receptor 1
Type:G Protein-Coupled Receptor (GPCR)
Mol. Mass.:52868.96
Organism:Homo sapiens (Human)
Description:P21554
Residue:472
BDBM50140232
NameBDBM50140232
Synonyms:1-(4-Chloro-phenyl)-2-(2,4-dichloro-phenyl)-5-methyl-1H-imidazole-4-carboxylic acid (hexahydro-cyclopenta[c]pyrrol-2-yl)-amide | CHEMBL418721
TypeSmall organic molecule
Emp. Form.C24H23Cl3N4O
Mol. Mass.489.825
SMILESCc1c(nc(-c2ccc(Cl)cc2Cl)n1-c1ccc(Cl)cc1)C(=O)NN1CC2CCCC2C1