Reaction Details
TargetCannabinoid receptor 2
LigandBDBM50163129
Substrate/Competitorn/a
Meas. Tech.ChEMBL_303175 (CHEMBL829669)
Ki 489±n/a nM
Citation Lange, JHvan Stuivenberg, HHCoolen, HKAdolfs, TJMcCreary, ACKeizer, HGWals, HCVeerman, WBorst, AJde Looff, WVerveer, PCKruse, CG Bioisosteric replacements of the pyrazole moiety of rimonabant: synthesis, biological properties, and molecular modeling investigations of thiazoles, triazoles, and imidazoles as potent and selective CB1 cannabinoid receptor antagonists. J Med Chem48:1823-38 (2005) 
 
Cannabinoid receptor 2
Name:Cannabinoid receptor 2
Type:G Protein-Coupled Receptor (GPCR)
Mol. Mass.:39690.94
Organism:Homo sapiens (Human)
Description:P34972
Residue:360
BDBM50163129
NameBDBM50163129
Synonyms:1-(4-Bromo-phenyl)-2-(2,4-dichloro-phenyl)-5-methyl-1H-imidazole-4-carboxylic acid piperidin-1-ylamide | CHEMBL175292
TypeSmall organic molecule
Emp. Form.C22H21BrCl2N4O
Mol. Mass.508.238
SMILESCc1c(nc(-c2ccc(Cl)cc2Cl)n1-c1ccc(Br)cc1)C(=O)NN1CCCCC1