Reaction Details
TargetCannabinoid receptor 1
LigandBDBM50163132
Substrate/Competitorn/a
Meas. Tech.ChEMBL_303193 (CHEMBL829819)
Ki 23±n/a nM
Citation Lange, JHvan Stuivenberg, HHCoolen, HKAdolfs, TJMcCreary, ACKeizer, HGWals, HCVeerman, WBorst, AJde Looff, WVerveer, PCKruse, CG Bioisosteric replacements of the pyrazole moiety of rimonabant: synthesis, biological properties, and molecular modeling investigations of thiazoles, triazoles, and imidazoles as potent and selective CB1 cannabinoid receptor antagonists. J Med Chem48:1823-38 (2005) 
 
Cannabinoid receptor 1
Name:Cannabinoid receptor 1
Type:G Protein-Coupled Receptor (GPCR)
Mol. Mass.:52868.96
Organism:Homo sapiens (Human)
Description:P21554
Residue:472
BDBM50163132
NameBDBM50163132
Synonyms:5-Bromo-1-(4-chloro-phenyl)-2-(2,4-dichloro-phenyl)-1H-imidazole-4-carboxylic acid piperidin-1-ylamide | CHEMBL427497
TypeSmall organic molecule
Emp. Form.C21H18BrCl3N4O
Mol. Mass.528.657
SMILESClc1ccc(cc1)-n1c(Br)c(nc1-c1ccc(Cl)cc1Cl)C(=O)NN1CCCCC1