Reaction Details
TargetCannabinoid receptor 1
LigandBDBM50163131
Substrate/Competitorn/a
Meas. Tech.ChEMBL_303193 (CHEMBL829819)
Ki 333±n/a nM
Citation Lange, JHvan Stuivenberg, HHCoolen, HKAdolfs, TJMcCreary, ACKeizer, HGWals, HCVeerman, WBorst, AJde Looff, WVerveer, PCKruse, CG Bioisosteric replacements of the pyrazole moiety of rimonabant: synthesis, biological properties, and molecular modeling investigations of thiazoles, triazoles, and imidazoles as potent and selective CB1 cannabinoid receptor antagonists. J Med Chem48:1823-38 (2005) 
 
Cannabinoid receptor 1
Name:Cannabinoid receptor 1
Type:G Protein-Coupled Receptor (GPCR)
Mol. Mass.:52868.96
Organism:Homo sapiens (Human)
Description:P21554
Residue:472
BDBM50163131
NameBDBM50163131
Synonyms:1-(4-Chloro-phenyl)-2-(2,4-dichloro-phenyl)-5-methyl-1H-imidazole-4-carboxylic acid tert-butoxy-amide | CHEMBL360138
TypeSmall organic molecule
Emp. Form.C21H20Cl3N3O2
Mol. Mass.452.761
SMILESCc1c(nc(-c2ccc(Cl)cc2Cl)n1-c1ccc(Cl)cc1)C(=O)NOC(C)(C)C