Reaction Details
TargetCannabinoid receptor 1
LigandBDBM50163116
Substrate/Competitorn/a
Meas. Tech.ChEMBL_303193 (CHEMBL829819)
Ki 227±n/a nM
Citation Lange, JHvan Stuivenberg, HHCoolen, HKAdolfs, TJMcCreary, ACKeizer, HGWals, HCVeerman, WBorst, AJde Looff, WVerveer, PCKruse, CG Bioisosteric replacements of the pyrazole moiety of rimonabant: synthesis, biological properties, and molecular modeling investigations of thiazoles, triazoles, and imidazoles as potent and selective CB1 cannabinoid receptor antagonists. J Med Chem48:1823-38 (2005) 
 
Cannabinoid receptor 1
Name:Cannabinoid receptor 1
Type:G Protein-Coupled Receptor (GPCR)
Mol. Mass.:52868.96
Organism:Homo sapiens (Human)
Description:P21554
Residue:472
BDBM50163116
NameBDBM50163116
Synonyms:5-(4-Chloro-phenyl)-4-(2,4-dichloro-phenyl)-thiazole-2-carboxylic acid piperidin-1-ylamide | CHEMBL177403
TypeSmall organic molecule
Emp. Form.C21H18Cl3N3OS
Mol. Mass.466.811
SMILESClc1ccc(cc1)-c1sc(nc1-c1ccc(Cl)cc1Cl)C(=O)NN1CCCCC1