Reaction Details
TargetCannabinoid receptor 2
LigandBDBM50163127
Substrate/Competitorn/a
Meas. Tech.ChEMBL_303175 (CHEMBL829669)
Ki 3959±n/a nM
Citation Lange, JHvan Stuivenberg, HHCoolen, HKAdolfs, TJMcCreary, ACKeizer, HGWals, HCVeerman, WBorst, AJde Looff, WVerveer, PCKruse, CG Bioisosteric replacements of the pyrazole moiety of rimonabant: synthesis, biological properties, and molecular modeling investigations of thiazoles, triazoles, and imidazoles as potent and selective CB1 cannabinoid receptor antagonists. J Med Chem48:1823-38 (2005) 
 
Cannabinoid receptor 2
Name:Cannabinoid receptor 2
Type:G Protein-Coupled Receptor (GPCR)
Mol. Mass.:39690.94
Organism:Homo sapiens (Human)
Description:P34972
Residue:360
BDBM50163127
NameBDBM50163127
Synonyms:CHEMBL173662 | [1-(4-Chloro-phenyl)-2-(2,4-dichloro-phenyl)-5-methyl-1H-imidazol-4-yl]-(4-hydroxy-piperidin-1-yl)-methanone
TypeSmall organic molecule
Emp. Form.C22H20Cl3N3O2
Mol. Mass.464.772
SMILESCc1c(nc(-c2ccc(Cl)cc2Cl)n1-c1ccc(Cl)cc1)C(=O)N1CCC(O)CC1