Reaction Details
TargetAdenosine receptor A2a
LigandBDBM50163402
Substrate/Competitorn/a
Meas. Tech.ChEMBL_303283 (CHEMBL828276)
Ki 4±n/a nM
Citation Vu, CBPan, DPeng, BKumaravel, GSmits, GJin, XPhadke, DEngber, THuang, CReilly, JTam, SGrant, DHetu, GPetter, RC Novel diamino derivatives of [1,2,4]triazolo[1,5-a][1,3,5]triazine as potent and selective adenosine A2a receptor antagonists. J Med Chem48:2009-18 (2005) 
 
Adenosine receptor A2a
Name:Adenosine receptor A2a
Type:G Protein-Coupled Receptor (GPCR)
Mol. Mass.:45015.65
Organism:Rattus norvegicus (rat)
Description:Rat A2A receptors expressed in CHO cells.
Residue:410
BDBM50163402
NameBDBM50163402
Synonyms:CHEMBL176071 | N*5*-[(R)-1-(2-Fluoro-5-trifluoromethyl-benzyl)-pyrrolidin-2-ylmethyl]-2-furan-2-yl-[1,2,4]triazolo[1,5-a][1,3,5]triazine-5,7-diamine
TypeSmall organic molecule
Emp. Form.C21H20F4N8O
Mol. Mass.476.4301
SMILESNc1nc(NC[C@H]2CCCN2Cc2cc(ccc2F)C(F)(F)F)nc2nc(nn12)-c1ccco1