Reaction Details
TargetAdenosine receptor A2a
LigandBDBM50163412
Substrate/Competitorn/a
Meas. Tech.ChEMBL_303283 (CHEMBL828276)
Ki 8±n/a nM
Citation Vu, CBPan, DPeng, BKumaravel, GSmits, GJin, XPhadke, DEngber, THuang, CReilly, JTam, SGrant, DHetu, GPetter, RC Novel diamino derivatives of [1,2,4]triazolo[1,5-a][1,3,5]triazine as potent and selective adenosine A2a receptor antagonists. J Med Chem48:2009-18 (2005) 
 
Adenosine receptor A2a
Name:Adenosine receptor A2a
Type:G Protein-Coupled Receptor (GPCR)
Mol. Mass.:45015.65
Organism:Rattus norvegicus (rat)
Description:Rat A2A receptors expressed in CHO cells.
Residue:410
BDBM50163412
NameBDBM50163412
Synonyms:2-Furan-2-yl-N*5*-[(R)-1-(2,4,5-trifluoro-benzyl)-pyrrolidin-2-ylmethyl]-[1,2,4]triazolo[1,5-a][1,3,5]triazine-5,7-diamine | CHEMBL177859
TypeSmall organic molecule
Emp. Form.C20H19F3N8O
Mol. Mass.444.4131
SMILESNc1nc(NC[C@H]2CCCN2Cc2cc(F)c(F)cc2F)nc2nc(nn12)-c1ccco1