Reaction Details
TargetAdenosine receptor A2a
LigandBDBM50163417
Substrate/Competitorn/a
Meas. Tech.ChEMBL_303283 (CHEMBL828276)
Ki 18±n/a nM
Citation Vu, CBPan, DPeng, BKumaravel, GSmits, GJin, XPhadke, DEngber, THuang, CReilly, JTam, SGrant, DHetu, GPetter, RC Novel diamino derivatives of [1,2,4]triazolo[1,5-a][1,3,5]triazine as potent and selective adenosine A2a receptor antagonists. J Med Chem48:2009-18 (2005) 
 
Adenosine receptor A2a
Name:Adenosine receptor A2a
Type:G Protein-Coupled Receptor (GPCR)
Mol. Mass.:45015.65
Organism:Rattus norvegicus (rat)
Description:Rat A2A receptors expressed in CHO cells.
Residue:410
BDBM50163417
NameBDBM50163417
Synonyms:2-Furan-2-yl-N*5*-((R)-1-furan-2-ylmethyl-pyrrolidin-2-ylmethyl)-[1,2,4]triazolo[1,5-a][1,3,5]triazine-5,7-diamine | CHEMBL369550
TypeSmall organic molecule
Emp. Form.C18H20N8O2
Mol. Mass.380.4038
SMILESNc1nc(NC[C@H]2CCCN2Cc2ccco2)nc2nc(nn12)-c1ccco1