Reaction Details
TargetAndrogen receptor
LigandBDBM50367916
Substrate/Competitorn/a
Meas. Tech.ChEMBL_302157 (CHEMBL829225)
Kd 1.51±n/a nM
Citation Gilli, PGilli, GBorea, PAVarani, KScatturin, ADalpiaz, A Binding thermodynamics as a tool to investigate the mechanisms of drug-receptor interactions: thermodynamics of cytoplasmic steroid/nuclear receptors in comparison with membrane receptors. J Med Chem48:2026-35 (2005) 
 
Androgen receptor
Name:Androgen receptor
Type:Receptor
Mol. Mass.:99185.27
Organism:Homo sapiens (Human)
Description:CHO cells were stably transfected with human AR gene.
Residue:920
BDBM50367916
NameBDBM50367916
Synonyms:METHYLTRIENOLONE R-1881
TypeSmall organic molecule
Emp. Form.C19H24O2
Mol. Mass.284.3927
SMILESC[C@]1(O)CC[C@H]2[C@@H]3CCC4=CC(=O)CCC4=C3C=C[C@]12C