Reaction Details
TargetcGMP-specific 3',5'-cyclic phosphodiesterase
LigandBDBM50163572
Substrate/Competitorn/a
Meas. Tech.ChEMBL_303177 (CHEMBL829671)
Ki 0.33±n/a nM
Citation Jiang, WGuan, JMacielag, MJZhang, SQiu, YKraft, PBhattacharjee, SJohn, TMHaynes-Johnson, DLundeen, SSui, Z Pyrroloquinolone PDE5 inhibitors with improved pharmaceutical profiles for clinical studies on erectile dysfunction. J Med Chem48:2126-33 (2005) 
 
cGMP-specific 3',5'-cyclic phosphodiesterase
Name:cGMP-specific 3',5'-cyclic phosphodiesterase
Type:PROTEIN
Mol. Mass.:94547.60
Organism:Rattus norvegicus
Description:ChEMBL_155367
Residue:833
BDBM50163572
NameBDBM50163572
Synonyms:3-(2,3-Dihydro-benzofuran-5-yl)-2-[5-(3-methyl-3H-imidazol-4-yl)-pyridin-2-yl]-1,2,3,4-tetrahydro-pyrrolo[3,4-b]quinolin-9-one | CHEMBL367142
TypeSmall organic molecule
Emp. Form.C28H23N5O2
Mol. Mass.461.5145
SMILESCn1cncc1-c1ccc(nc1)N1Cc2c(nc3ccccc3c2O)C1c1ccc2OCCc2c1