Reaction Details
TargetcGMP-specific 3',5'-cyclic phosphodiesterase
LigandBDBM50163575
Substrate/Competitorn/a
Meas. Tech.ChEMBL_303177 (CHEMBL829671)
Ki 0.65±n/a nM
Citation Jiang, WGuan, JMacielag, MJZhang, SQiu, YKraft, PBhattacharjee, SJohn, TMHaynes-Johnson, DLundeen, SSui, Z Pyrroloquinolone PDE5 inhibitors with improved pharmaceutical profiles for clinical studies on erectile dysfunction. J Med Chem48:2126-33 (2005) 
 
cGMP-specific 3',5'-cyclic phosphodiesterase
Name:cGMP-specific 3',5'-cyclic phosphodiesterase
Type:PROTEIN
Mol. Mass.:94547.60
Organism:Rattus norvegicus
Description:ChEMBL_155367
Residue:833
BDBM50163575
NameBDBM50163575
Synonyms:3-(2,3-Dihydro-benzofuran-5-yl)-2-pyridin-2-yl-1,2,3,4-tetrahydro-pyrrolo[3,4-b]quinolin-9-one | CHEMBL175987
TypeSmall organic molecule
Emp. Form.C24H19N3O2
Mol. Mass.381.4266
SMILESOc1c2CN(C(c2nc2ccccc12)c1ccc2OCCc2c1)c1ccccn1