Reaction Details
TargetReverse transcriptase/RNaseH
LigandBDBM50164656
Substrate/Competitorn/a
Meas. Tech.ChEMBL_302539 (CHEMBL875215)
Ki 438±n/a nM
Citation Boyle, NARajwanshi, VKPrhavc, MWang, GFagan, PChen, FEwing, GJBrooks, JLHurd, TLeeds, JMBruice, TWCook, PD Synthesis of 2',3'-dideoxynucleoside 5'-alpha-P-borano-beta,gamma-(difluoromethylene)triphosphates and their inhibition of HIV-1 reverse transcriptase. J Med Chem48:2695-700 (2005) 
 
Reverse transcriptase/RNaseH
Name:Reverse transcriptase/RNaseH
Type:PROTEIN
Mol. Mass.:65229.15
Organism:Human immunodeficiency virus 1
Description:ChEMBL_1473730
Residue:566
BDBM50164656
NameBDBM50164656
Synonyms:2',3'-Dideoxynucleoside5'-alpha-P-Borano-beta,gamma-(difluoromethylene)triphosphates derivative | CHEMBL426278
TypeSmall organic molecule
Emp. Form.C10H14BF2N2O11P3
Mol. Mass.479.956
SMILES[BH3-]P(=O)(OCC1CCC(O1)n1ccc(=O)[nH]c1=O)OP([O-])(=O)C(F)(F)P([O-])([O-])=O