Reaction Details
TargetPolyprenyl synthetase family protein
LigandBDBM25310
Substrate/Competitorn/a
Meas. Tech.ChEMBL_302625 (CHEMBL839917)
Ki 18±n/a nM
Citation Sanders, JMSong, YChan, JMZhang, YJennings, SKosztowski, TOdeh, SFlessner, RSchwerdtfeger, CKotsikorou, EMeints, GAGómez, AOGonzález-Pacanowska, DRaker, AMWang, Hvan Beek, ERPapapoulos, SEMorita, CTOldfield, E Pyridinium-1-yl bisphosphonates are potent inhibitors of farnesyl diphosphate synthase and bone resorption. J Med Chem48:2957-63 (2005) 
 
Polyprenyl synthetase family protein
Name:Polyprenyl synthetase family protein
Type:PROTEIN
Mol. Mass.:41078.35
Organism:Plasmodium falciparum (isolate 3D7)
Description:ChEMBL_330072
Residue:362
BDBM25310
NameBDBM25310
Synonyms:1-(2-hydrogen phosphonato-2-hydroxy-2-phosphonoethyl)pyridin-1-ium bisphosphonate, 59
TypeSmall organic molecule
Emp. Form.C7H11NO7P2
Mol. Mass.283.1123
SMILESOC(C[n+]1ccccc1)(P(O)(O)=O)P(O)([O-])=O