Reaction Details
TargetPolyprenyl synthetase family protein
LigandBDBM12578
Substrate/Competitorn/a
Meas. Tech.ChEMBL_302625 (CHEMBL839917)
Ki 11±n/a nM
Citation Sanders, JMSong, YChan, JMZhang, YJennings, SKosztowski, TOdeh, SFlessner, RSchwerdtfeger, CKotsikorou, EMeints, GAGómez, AOGonzález-Pacanowska, DRaker, AMWang, Hvan Beek, ERPapapoulos, SEMorita, CTOldfield, E Pyridinium-1-yl bisphosphonates are potent inhibitors of farnesyl diphosphate synthase and bone resorption. J Med Chem48:2957-63 (2005) 
 
Polyprenyl synthetase family protein
Name:Polyprenyl synthetase family protein
Type:PROTEIN
Mol. Mass.:41078.35
Organism:Plasmodium falciparum (isolate 3D7)
Description:ChEMBL_330072
Residue:362
BDBM12578
NameBDBM12578
Synonyms:2-(imidazol-1-yl)-1-hydroxyethylidene-1,1-bisphosphonic acid CGP-42446 JMC515594 Compound 55 US11279719, Example Zolendronic acid (ZOL) Zoledronate [1-hydroxy-2-(1H-imidazol-1-yl)-1-phosphonoethyl]phosphonic acid | zoledronic acid
TypeSmall organic molecule
Emp. Form.C5H10N2O7P2
Mol. Mass.272.0896
SMILESOC(Cn1ccnc1)(P(O)(O)=O)P(O)(O)=O