Reaction Details
TargetCyclin-dependent kinase 2
LigandBDBM7755
Substrate/Competitorn/a
Meas. Tech.ChEBML_304863
IC50 10±n/a nM
Citation Putta, SLandrum, GAPenzotti, JE Conformation mining: an algorithm for finding biologically relevant conformations. J Med Chem48:3313-8 (2005) 
 
Cyclin-dependent kinase 2
Name:Cyclin-dependent kinase 2
Type:Enzyme Subunit
Mol. Mass.:33938.17
Organism:Homo sapiens (Human)
Description:P24941
Residue:298
BDBM7755
NameBDBM7755
Synonyms:4-({[(12Z)-11-oxo-3-thia-5,10-diazatricyclo[7.3.0.0^{2,6}]dodeca-1,4,6,8-tetraen-12-ylidene]methyl}amino)-N-(pyridin-2-yl)benzene-1-sulfonamide Oxindole-Based Inhibitor 91
TypeSmall organic molecule
Emp. Form.C21H15N5O3S2
Mol. Mass.449.506
SMILESO=C1Nc2ccc3ncsc3c2C1C=Nc1ccc(cc1)S(=O)(=O)Nc1ccccn1