Reaction Details
TargetMelanocyte-stimulating hormone receptor
LigandBDBM50166125
Substrate/Competitorn/a
Meas. Tech.ChEMBL_304145 (CHEMBL840261)
EC50 0.33±n/a nM
Citation Todorovic, AHolder, JRBauzo, RMScott, JWKavanagh, RAbdel-Malek, ZHaskell-Luevano, C N-terminal fatty acylated His-dPhe-Arg-Trp-NH(2) tetrapeptides: influence of fatty acid chain length on potency and selectivity at the mouse melanocortin receptors and human melanocytes. J Med Chem48:3328-36 (2005) 
 
Melanocyte-stimulating hormone receptor
Name:Melanocyte-stimulating hormone receptor
Type:PROTEIN
Mol. Mass.:35238.60
Organism:Mus musculus
Description:ChEMBL_1498846
Residue:315
BDBM50166125
NameBDBM50166125
Synonyms:CHEMBL191303 | Octanoic acid [(S)-1-((R)-1-{(S)-1-[(S)-1-carbamoyl-2-(1H-indol-3-yl)-ethylcarbamoyl]-4-guanidino-butylcarbamoyl}-2-phenyl-ethylcarbamoyl)-2-(3H-imidazol-4-yl)-ethyl]-amide
TypeSmall organic molecule
Emp. Form.C40H55N11O5
Mol. Mass.769.9354
SMILESCCCCCCCC(=O)N[C@@H](Cc1cnc[nH]1)C(=O)N[C@H](Cc1ccccc1)C(=O)N[C@@H](CCCNC(N)=N)C(=O)N[C@@H](Cc1c[nH]c2ccccc12)C(N)=O