Reaction Details
TargetMelanocortin receptor 4
LigandBDBM50166123
Substrate/Competitorn/a
Meas. Tech.ChEMBL_304147 (CHEMBL840263)
EC50 0.06±n/a nM
Citation Todorovic, AHolder, JRBauzo, RMScott, JWKavanagh, RAbdel-Malek, ZHaskell-Luevano, C N-terminal fatty acylated His-dPhe-Arg-Trp-NH(2) tetrapeptides: influence of fatty acid chain length on potency and selectivity at the mouse melanocortin receptors and human melanocytes. J Med Chem48:3328-36 (2005) 
 
Melanocortin receptor 4
Name:Melanocortin receptor 4
Type:PROTEIN
Mol. Mass.:36964.43
Organism:Mus musculus
Description:ChEMBL_1498850
Residue:332
BDBM50166123
NameBDBM50166123
Synonyms:CHEMBL408600 | [(2S,5R,8R,11R,14S,17R)-1-(2-Acetylamino-hexanoyl)-17-(4-amino-butyl)-8-benzyl-11-(3-guanidino-propyl)-5-(3H-imidazol-4-ylmethyl)-14-(1H-indol-3-ylmethyl)-3,6,9,12,15,18-hexaoxo-1,4,7,10,13,16hexaaza-cyclooctadec-2-yl]-acetic acid
TypeSmall organic molecule
Emp. Form.C50H68N14O10
Mol. Mass.1025.1627
SMILESCCCCC(NC(C)=O)C(=O)N1[C@@H](CC(O)=O)C(=O)N[C@H](Cc2cnc[nH]2)C(=O)N[C@H](Cc2ccccc2)C(=O)N[C@H](CCCNC(N)=N)C(=O)N[C@@H](Cc2c[nH]c3ccccc23)C(=O)N[C@H](CCCCN)C1=O