Reaction Details
TargetHistone deacetylase 2b
LigandBDBM19149
Substrate/Competitorn/a
Meas. Tech.ChEMBL_305568 (CHEMBL827162)
IC50 50±n/a nM
Citation Mai, AMassa, SPezzi, RSimeoni, SRotili, DNebbioso, AScognamiglio, AAltucci, LLoidl, PBrosch, G Class II (IIa)-selective histone deacetylase inhibitors. 1. Synthesis and biological evaluation of novel (aryloxopropenyl)pyrrolyl hydroxyamides. J Med Chem48:3344-53 (2005) 
 
Histone deacetylase 2b
Name:Histone deacetylase 2b
Synonyms:Histone deacetylase HD2
Type:PROTEIN
Mol. Mass.:30785.07
Organism:Zea mays
Description:ChEMBL_87549
Residue:286
BDBM19149
NameBDBM19149
TypeSmall organic molecule
Emp. Form.C14H20N2O3
Mol. Mass.264.3202
SMILESONC(=O)CCCCCCC(=O)Nc1ccccc1