Reaction Details
TargetMu-type opioid receptor
LigandBDBM50166212
Substrate/Competitorn/a
Meas. Tech.ChEMBL_303276 (CHEMBL828270)
Ki 0.16±n/a nM
Citation Lattanzi, RSpetea, MSchüllner, FRief, SBKrassnig, RNegri, LSchmidhammer, H Synthesis and biological evaluation of 14-alkoxymorphinans. 22.(1) Influence of the 14-alkoxy group and the substitution in position 5 in 14-alkoxymorphinan-6-ones on in vitro and in vivo activities. J Med Chem48:3372-8 (2005) 
 
Mu-type opioid receptor
Name:Mu-type opioid receptor
Type:G Protein-Coupled Receptor (GPCR)
Mol. Mass.:44503.11
Organism:Rattus norvegicus (rat)
Description:Competition binding assays were carried out using membrane preparations from transfected HN9.10 cells that constitutively expressed the mu opioid receptor.
Residue:398
BDBM50166212
NameBDBM50166212
Synonyms:17-ethoxy-10-hydroxy-13-methyl-4-phenethyl-(13R,17S)-12-oxa-4-azapentacyclo[9.6.1.01,13.05,17.07,18]octadeca-7(18),8,10-trien-14-one
TypeSmall organic molecule
Emp. Form.C27H31NO4
Mol. Mass.433.5393
SMILESCCO[C@]12CCC(=O)[C@]3(C)Oc4c5c(CC1N(CCc1ccccc1)CC[C@@]235)ccc4O