Reaction Details
TargetNeuronal acetylcholine receptor subunit alpha-7
LigandBDBM50173947
Substrate/Competitorn/a
Meas. Tech.ChEMBL_321014 (CHEMBL871846)
Ki 4.1±n/a nM
Citation Baker, SRBoot, JBrunavs, MDobson, DGreen, RHayhurst, LKeenan, MWallace, L High affinity ligands for the alpha7 nicotinic receptor that show no cross-reactivity with the 5-HT3 receptor. Bioorg Med Chem Lett15:4727-30 (2005) 
 
Neuronal acetylcholine receptor subunit alpha-7
Name:Neuronal acetylcholine receptor subunit alpha-7
Type:n/a
Mol. Mass.:56448.33
Organism:Homo sapiens (Human)
Description: CHRNA7 (NACHRA7)
Residue:502
BDBM50173947
NameBDBM50173947
Synonyms:5-Phenyl-isothiazole-3-carboxylic acid (1-aza-bicyclo[2.2.2]oct-3-yl)-amide | CHEMBL372041
TypeSmall organic molecule
Emp. Form.C17H19N3OS
Mol. Mass.313.417
SMILESO=C(NC1CN2CCC1CC2)c1cc(sn1)-c1ccccc1