Reaction Details
TargetGlucocorticoid receptor
LigandBDBM50172020
Substrate/Competitorn/a
Meas. Tech.ChEMBL_321442 (CHEMBL880250)
IC50 7±n/a nM
Citation Betageri, RZhang, YZindell, RMKuzmich, DKirrane, TMBentzien, JCardozo, MCapolino, AJFadra, TNNelson, RMPaw, ZShih, DTShih, CKZuvela-Jelaska, LNabozny, GThomson, DS Trifluoromethyl group as a pharmacophore: effect of replacing a CF3 group on binding and agonist activity of a glucocorticoid receptor ligand. Bioorg Med Chem Lett15:4761-9 (2005) 
 
Glucocorticoid receptor
Name:Glucocorticoid receptor
Type:Enzyme
Mol. Mass.:85656.87
Organism:Homo sapiens (Human)
Description:P04150
Residue:777
BDBM50172020
NameBDBM50172020
Synonyms:2-Cyclohexylmethyl-4-(5-fluoro-2-hydroxy-phenyl)-2-hydroxy-4-methyl-pentanoic acid (4-methyl-1-oxo-1H-benzo[d][1,2]oxazin-6-yl)-amide | CHEMBL195962
TypeSmall organic molecule
Emp. Form.C28H33FN2O5
Mol. Mass.496.5704
SMILESCc1noc(=O)c2ccc(NC(=O)C(O)(CC3CCCCC3)CC(C)(C)c3cc(F)ccc3O)cc12