Reaction Details
TargetCannabinoid receptor 2
LigandBDBM50172907
Substrate/Competitorn/a
Meas. Tech.ChEMBL_320878 (CHEMBL884803)
Ki 3526±n/a nM
Citation Lange, JHvan Stuivenberg, HHVeerman, WWals, HCStork, BCoolen, HKMcCreary, ACAdolfs, TJKruse, CG Novel 3,4-diarylpyrazolines as potent cannabinoid CB1 receptor antagonists with lower lipophilicity. Bioorg Med Chem Lett15:4794-8 (2005) 
 
Cannabinoid receptor 2
Name:Cannabinoid receptor 2
Type:G Protein-Coupled Receptor (GPCR)
Mol. Mass.:39690.94
Organism:Homo sapiens (Human)
Description:P34972
Residue:360
BDBM50172907
NameBDBM50172907
Synonyms:3,4-diarylpyrazoline derivative | CHEMBL383580
TypeSmall organic molecule
Emp. Form.C21H24ClN5O2S2
Mol. Mass.478.031
SMILESCN=C(NS(=O)(=O)N1CCSCC1)N1CC(C(=N1)c1ccc(Cl)cc1)c1ccccc1