Reaction Details
TargetSeed linoleate 13S-lipoxygenase-1
LigandBDBM22356
Substrate/Competitorn/a
Meas. Tech.ChEMBL_321375 (CHEMBL881519)
IC50 300±n/a nM
Citation Rao, PNChen, QHKnaus, EE Synthesis and biological evaluation of 1,3-diphenylprop-2-yn-1-ones as dual inhibitors of cyclooxygenases and lipoxygenases. Bioorg Med Chem Lett15:4842-5 (2005) 
 
Seed linoleate 13S-lipoxygenase-1
Name:Seed linoleate 13S-lipoxygenase-1
Type:Enzyme
Mol. Mass.:94365.66
Organism:Glycine max (soybean)
Description:n/a
Residue:839
BDBM22356
NameBDBM22356
Synonyms:1,3-Diarylprop-2-yn-1-one, 13m CHEMBL364739
TypeSmall organic molecule
Emp. Form.C16H12O4S
Mol. Mass.300.329
SMILESCS(=O)(=O)c1ccc(cc1)C#CC(=O)c1cccc(O)c1