Reaction Details
TargetNeuronal acetylcholine receptor subunit alpha-7
LigandBDBM50174177
Substrate/Competitorn/a
Meas. Tech.ChEMBL_320960 (CHEMBL885367)
Ki 25±n/a nM
Citation Coe, JWBrooks, PRWirtz, MCBashore, CGBianco, KEVetelino, MGArnold, EPLebel, LAFox, CBTingley, FDSchulz, DWDavis, TISands, SBMansbach, RSRollema, HO'Neill, BT 3,5-Bicyclic aryl piperidines: a novel class of alpha4beta2 neuronal nicotinic receptor partial agonists for smoking cessation. Bioorg Med Chem Lett15:4889-97 (2005) 
 
Neuronal acetylcholine receptor subunit alpha-7
Name:Neuronal acetylcholine receptor subunit alpha-7
Type:n/a
Mol. Mass.:56448.33
Organism:Homo sapiens (Human)
Description: CHRNA7 (NACHRA7)
Residue:502
BDBM50174177
NameBDBM50174177
Synonyms:7-propyl-5,7,13-triazatetracyclo[9.3.1.02,10.04,8]pentadeca-2(10),3,5,8-tetraene | CHEMBL199152
TypeSmall organic molecule
Emp. Form.C15H19N3
Mol. Mass.241.3315
SMILESCCCn1cnc2cc3C4CC(CNC4)c3cc12