Reaction Details
TargetHeat shock protein HSP 90-alpha
LigandBDBM50030868
Substrate/Competitorn/a
Meas. Tech.ChEMBL_320742 (CHEMBL881215)
Kd 100±n/a nM
Citation Rastelli, GTian, ZQWang, ZMyles, DLiu, Y Structure-based design of 7-carbamate analogs of geldanamycin. Bioorg Med Chem Lett15:5016-21 (2005) 
 
Heat shock protein HSP 90-alpha
Name:Heat shock protein HSP 90-alpha
Type:Molecular Chaperone
Mol. Mass.:84623.45
Organism:Homo sapiens (Human)
Description:P07900
Residue:732
BDBM50030868
NameBDBM50030868
Synonyms:(8S,9S,12S,13R,14S,16R)-19-amino-13-hydroxy-8,14-dimethoxy-4,10,12,16-tetramethyl-3,20,22-trioxo-2-azabicyclo[16.3.1]docosa-1(21),4,6,10,18-pentaen-9-yl carbamate 17-desmethoxy-17-aminogeldanamycin Carbamic acid (4E,6Z)-(13S,14S,17R,19S)-19-amino-13-(S)-hydroxy-8,14-dimethoxy-4,12,16-trimethyl-10-(R)-methyl-3,20,22-trioxo-2-aza-bicyclo[16.3.1]docosa-1(21),4,6,10,18-pentaen-9-yl ester | Carbamic acid (4E,6Z,10E)-(8S,9S,12S,13R,14S,16R)-19-amino-13-hydroxy-8,14-dimethoxy-4,10,12,16-tetramethyl-3,20,22-trioxo-2-aza-bicyclo[16.3.1]docosa-1(21),4,6,10,18-pentaen-9-yl ester
TypeSmall organic molecule
Emp. Form.C28H39N3O8
Mol. Mass.545.6246
SMILESCO[C@H]1CC(C)=Cc2c(N)c(O)cc(NC(=O)C(C)=CC=C[C@H](OC)[C@@H](OC(N)=O)\C(C)=C\[C@H](C)[C@H]1O)c2O