Reaction Details
TargetProtein-S-isoprenylcysteine O-methyltransferase
LigandBDBM50174225
Substrate/Competitorn/a
Meas. Tech.ChEMBL_320848 (CHEMBL884633)
Ki 4600±n/a nM
Citation Henriksen, BSAnderson, JLHrycyna, CAGibbs, RA Synthesis of desthio prenylcysteine analogs: sulfur is important for biological activity. Bioorg Med Chem Lett15:5080-3 (2005) 
 
Protein-S-isoprenylcysteine O-methyltransferase
Name:Protein-S-isoprenylcysteine O-methyltransferase
Type:PROTEIN
Mol. Mass.:27893.87
Organism:Saccharomyces cerevisiae
Description:ChEMBL_321482
Residue:239
BDBM50174225
NameBDBM50174225
Synonyms:((2E,6E)-3,7,11-Trimethyl-dodeca-2,6,10-trienylsulfanyl)-acetic acid anion
TypeSmall organic molecule
Emp. Form.C17H27O2S
Mol. Mass.295.461
SMILES[#6]\[#6](-[#6])=[#6]\[#6]-[#6]\[#6](-[#6])=[#6]\[#6]-[#6]\[#6](-[#6])=[#6]\[#6]-[#16]-[#6]-[#6](-[#8-])=O