Reaction Details
TargetBile acid receptor
LigandBDBM50167161
Substrate/Competitorn/a
Meas. Tech.ChEMBL_321096 (CHEMBL882066)
EC50 25±n/a nM
Citation Nicolaou, KC Joys of molecules. 2. Endeavors in chemical biology and medicinal chemistry. J Med Chem48:5613-38 (2005) 
 
Bile acid receptor
Name:Bile acid receptor
Type:Nuclear Receptor
Mol. Mass.:55916.24
Organism:Homo sapiens (Human)
Description:Q96RI1
Residue:486
BDBM50167161
NameBDBM50167161
Synonyms:(E)-3-{3-[Cyclohexanecarbonyl-(4'-dimethylamino-biphenyl-4-ylmethyl)-amino]-phenyl}-acrylic acid methyl ester | CHEMBL192966
TypeSmall organic molecule
Emp. Form.C32H36N2O3
Mol. Mass.496.6398
SMILESCOC(=O)\C=C\c1cccc(c1)N(Cc1ccc(cc1)-c1ccc(cc1)N(C)C)C(=O)C1CCCCC1