Reaction Details
TargetSodium channel protein type 1/2/3 subunit alpha
LigandBDBM50172364
Substrate/Competitorn/a
Meas. Tech.ChEMBL_321328 (CHEMBL880612)
IC50 15.02±n/a nM
Citation Nicolaou, KC Joys of molecules. 2. Endeavors in chemical biology and medicinal chemistry. J Med Chem48:5613-38 (2005) 
 
Sodium channel protein type 1/2/3 subunit alpha
Name:Sodium channel protein type 1/2/3 subunit alpha
Type:n/a
Mol. Mass.:n/a
Description:ASSAY_ID of EBI is 68595
Components:This complex has 3 components.
Component 1
Name:Sodium channel protein type 1 subunit alpha
Synonyms:NAC1 SCN1A Sodium (Site 1) Sodium channel protein type 1 subunit alpha Sodium channel protein type I subunit alpha Voltage-gated sodium channel subunit alpha Nav1.1
Type:Protein
Mol. Mass.:228952.47
Organism:Homo sapiens (Human)
Description:P35498
Residue:2009
Component 2
Name:Sodium channel protein type 2 subunit alpha
Synonyms:HBSC II SCN2A SCN2A2 Sodium (Site 2) Sodium channel protein type 2 alpha subunit Voltage-gated sodium channel subunit alpha Nav1.2
Type:Enzyme
Mol. Mass.:227954.68
Organism:Homo sapiens (Human)
Description:Q99250
Residue:2005
Component 3
Name:Sodium channel protein type 3 subunit alpha
Synonyms:KIAA1356 NAC3 SCN3A_HUMAN Sodium channel alpha subunits; brain (Types I, II, III) Voltage-gated sodium channel subunit alpha Nav1.3 (Nav1.3)
Type:Protein
Mol. Mass.:226276.42
Organism:Homo sapiens (Human)
Description:Q9NY46
Residue:2000
BDBM50172364
NameBDBM50172364
Synonyms:2-{[(1R,3S,5R,7S,9R,11S,12S,14R,16R,18S,20R,21Z,24S,26R,28S,30R,31R,33S,35R,37S,42R,44S,46R,48S)-12-hydroxy-1,3,11,24,31,41,44-heptamethyl-39-oxo-2,6,10,15,19,25,29,34,38,43,47-undecaoxaundecacyclo[26.22.0.0^{3,26}.0^{5,24}.0^{7,20}.0^{9,18}.0^{11,16}.0^{30,48}.0^{33,46}.0^{35,44}.0^{37,42}]pentaconta-21,40-dien-14-yl]methyl}prop-2-enal CHEMBL413858 | PbTx-2
TypeSmall organic molecule
Emp. Form.C50H70O14
Mol. Mass.895.0824
SMILESC[C@@H]1C[C@@H]2O[C@@H]3C[C@@H]4OC(=O)C=C(C)[C@H]4O[C@@]3(C)C[C@H]2O[C@H]2CC[C@@]3(C)O[C@@]4(C)C[C@H]5O[C@H]6C[C@H]7O[C@@]8(C)[C@@H](O)C[C@@H](CC(=C)C=O)O[C@@H]8C[C@@H]7O[C@@H]6\C=C/C[C@]5(C)O[C@@H]4C[C@@H]3O[C@H]12