Reaction Details
TargetCytochrome c oxidase subunit NDUFA4
LigandBDBM50172374
Substrate/Competitorn/a
Meas. Tech.ChEMBL_321337 (CHEMBL880621)
IC50 18±n/a nM
Citation Nicolaou, KC Joys of molecules. 2. Endeavors in chemical biology and medicinal chemistry. J Med Chem48:5613-38 (2005) 
 
Cytochrome c oxidase subunit NDUFA4
Name:Cytochrome c oxidase subunit NDUFA4
Type:PROTEIN
Mol. Mass.:9374.28
Organism:Homo sapiens (Human)
Description:ChEMBL_321338
Residue:81
BDBM50172374
NameBDBM50172374
Synonyms:2,2-Dimethyl-6-[1-(3,4,5-trimethoxy-benzyl)-vinyl]-chroman | CHEMBL197472
TypeSmall organic molecule
Emp. Form.C23H28O4
Mol. Mass.368.466
SMILESCOc1cc(CC(=C)c2ccc3OC(C)(C)CCc3c2)cc(OC)c1OC