Reaction Details
TargetSodium channel protein type 1/2/3 subunit alpha
LigandBDBM50172380
Substrate/Competitorn/a
Meas. Tech.ChEMBL_321328 (CHEMBL880612)
IC50>10000±n/a nM
Citation Nicolaou, KC Joys of molecules. 2. Endeavors in chemical biology and medicinal chemistry. J Med Chem48:5613-38 (2005) 
 
Sodium channel protein type 1/2/3 subunit alpha
Name:Sodium channel protein type 1/2/3 subunit alpha
Type:n/a
Mol. Mass.:n/a
Description:ASSAY_ID of EBI is 68595
Components:This complex has 3 components.
Component 1
Name:Sodium channel protein type 1 subunit alpha
Synonyms:NAC1 SCN1A Sodium (Site 1) Sodium channel protein type 1 subunit alpha Sodium channel protein type I subunit alpha Voltage-gated sodium channel subunit alpha Nav1.1
Type:Protein
Mol. Mass.:228952.47
Organism:Homo sapiens (Human)
Description:P35498
Residue:2009
Component 2
Name:Sodium channel protein type 2 subunit alpha
Synonyms:HBSC II SCN2A SCN2A2 Sodium (Site 2) Sodium channel protein type 2 alpha subunit Voltage-gated sodium channel subunit alpha Nav1.2
Type:Enzyme
Mol. Mass.:227954.68
Organism:Homo sapiens (Human)
Description:Q99250
Residue:2005
Component 3
Name:Sodium channel protein type 3 subunit alpha
Synonyms:KIAA1356 NAC3 SCN3A_HUMAN Sodium channel alpha subunits; brain (Types I, II, III) Voltage-gated sodium channel subunit alpha Nav1.3 (Nav1.3)
Type:Protein
Mol. Mass.:226276.42
Organism:Homo sapiens (Human)
Description:Q9NY46
Residue:2000
BDBM50172380
NameBDBM50172380
Synonyms:CHEMBL370148 | Truncated brevetoxin B
TypeSmall organic molecule
Emp. Form.C34H46O10
Mol. Mass.614.723
SMILESCC1=CC(=O)O[C@H]2C[C@H]3O[C@@]4(C)C\C=C/[C@H]5O[C@H]6C[C@H]7O[C@H](CC(=C)C=O)C[C@H](O)[C@]7(C)O[C@@H]6C[C@@H]5O[C@@H]4C[C@]3(C)O[C@]12C