Reaction Details
TargetBile acid receptor
LigandBDBM50172373
Substrate/Competitorn/a
Meas. Tech.ChEMBL_321103 (CHEMBL882869)
EC50 10000±n/a nM
Citation Nicolaou, KC Joys of molecules. 2. Endeavors in chemical biology and medicinal chemistry. J Med Chem48:5613-38 (2005) 
 
Bile acid receptor
Name:Bile acid receptor
Type:Nuclear Receptor
Mol. Mass.:55916.24
Organism:Homo sapiens (Human)
Description:Q96RI1
Residue:486
BDBM50172373
NameBDBM50172373
Synonyms:CHEMBL197473 | Cyclopropanecarboxylic acid (8-methoxy-2,2-dimethyl-2H-chromen-7-ylmethyl)-phenyl-amide
TypeSmall organic molecule
Emp. Form.C23H25NO3
Mol. Mass.363.4495
SMILESCOc1c(CN(C(=O)C2CC2)c2ccccc2)ccc2C=CC(C)(C)Oc12