Reaction Details
TargetDNA polymerase delta catalytic subunit
LigandBDBM50370476
Substrate/Competitorn/a
Meas. Tech.ChEMBL_321583 (CHEMBL884691)
pH7.5±n/a
IC50 2300±n/a nM
Commentsextracted
Citation Schnute, MECudahy, MMBrideau, RJHoma, FLHopkins, TAKnechtel, MLOien, NLPitts, TWPoorman, RAWathen, MWWieber, JL 4-Oxo-4,7-dihydrothieno[2,3-b]pyridines as non-nucleoside inhibitors of human cytomegalovirus and related herpesvirus polymerases. J Med Chem48:5794-804 (2005) 
 
DNA polymerase delta catalytic subunit
Name:DNA polymerase delta catalytic subunit
Type:PROTEIN
Mol. Mass.:123636.28
Organism:Homo sapiens (Human)
Description:ChEMBL_105737
Residue:1107
BDBM50370476
NameBDBM50370476
Synonyms:Combivir | ZIDOVUDINE TRIPHOSPHATE
TypeSmall organic molecule
Emp. Form.C10H16N5O13P3
Mol. Mass.507.181
SMILESCc1cn([C@H]2C[C@H](N=[N+]=[N-])[C@@H](CO[P@@](O)(=O)O[P@@](O)(=O)OP(O)(O)=O)O2)c(=O)[nH]c1=O