Reaction Details
TargetcGMP-gated cation channel alpha-1
LigandBDBM50172541
Substrate/Competitorn/a
Meas. Tech.ChEMBL_320711 (CHEMBL881697)
Kd 0.03±n/a nM
Citation Strassmaier, TUma, RGhatpande, ASBandyopadhyay, TSchaffer, MWitte, JMcDougal, PGBrown, RLKarpen, JW Modifications to the tetracaine scaffold produce cyclic nucleotide-gated channel blockers with widely varying efficacies. J Med Chem48:5805-12 (2005) 
 
cGMP-gated cation channel alpha-1
Name:cGMP-gated cation channel alpha-1
Type:PROTEIN
Mol. Mass.:79603.33
Organism:Bos taurus
Description:ChEMBL_320711
Residue:690
BDBM50172541
NameBDBM50172541
Synonyms:CHEMBL197404 | [3-(3-Amino-propylamino)-propyl]-[2-(4-butylamino-benzoyloxy)-ethyl]-dimethyl-ammonium
TypeSmall organic molecule
Emp. Form.C21H41N4O2
Mol. Mass.381.5742
SMILESCCCCNc1ccc(cc1)C(=O)OCC[N+](C)(C)CCC[NH2+]CCC[NH3+]