Reaction Details
TargetcGMP-gated cation channel alpha-1
LigandBDBM50172539
Substrate/Competitorn/a
Meas. Tech.ChEMBL_320710 (CHEMBL881696)
Kd 970000±n/a nM
Citation Strassmaier, TUma, RGhatpande, ASBandyopadhyay, TSchaffer, MWitte, JMcDougal, PGBrown, RLKarpen, JW Modifications to the tetracaine scaffold produce cyclic nucleotide-gated channel blockers with widely varying efficacies. J Med Chem48:5805-12 (2005) 
 
cGMP-gated cation channel alpha-1
Name:cGMP-gated cation channel alpha-1
Type:PROTEIN
Mol. Mass.:79603.33
Organism:Bos taurus
Description:ChEMBL_320711
Residue:690
BDBM50172539
NameBDBM50172539
Synonyms:4-[(4-{[2-(dimethylammonio)ethoxy]carbonyl}phenyl)amino]butan-1-aminium
TypeSmall organic molecule
Emp. Form.C15H27N3O2
Mol. Mass.281.3927
SMILESC[NH+](C)CCOC(=O)c1ccc(NCCCC[NH3+])cc1