Reaction Details
TargetDeoxyuridine 5'-triphosphate nucleotidohydrolase
LigandBDBM50173555
Substrate/Competitorn/a
Meas. Tech.ChEMBL_320965 (CHEMBL885372)
Ki 10000±n/a nM
Citation Nguyen, CKasinathan, GLeal-Cortijo, IMusso-Buendia, AKaiser, MBrun, RRuiz-Pérez, LMJohansson, NGGonzález-Pacanowska, DGilbert, IH Deoxyuridine triphosphate nucleotidohydrolase as a potential antiparasitic drug target. J Med Chem48:5942-54 (2005) 
 
Deoxyuridine 5'-triphosphate nucleotidohydrolase
Name:Deoxyuridine 5'-triphosphate nucleotidohydrolase
Synonyms:dUTP pyrophosphatase
Type:Protein
Mol. Mass.:19574.43
Organism:Plasmodium falciparum
Description:Q8II92
Residue:173
BDBM50173555
NameBDBM50173555
TypeSmall organic molecule
Emp. Form.C15H24N2O4Si
Mol. Mass.324.4476
SMILESCC(C)(C)[Si](C)(C)OCC1OC(C=C1)n1ccc(=O)[nH]c1=O