Reaction Details
TargetDeoxyuridine 5'-triphosphate nucleotidohydrolase
LigandBDBM50173535
Substrate/Competitorn/a
Meas. Tech.ChEMBL_320965 (CHEMBL885372)
Ki 1300±n/a nM
Citation Nguyen, CKasinathan, GLeal-Cortijo, IMusso-Buendia, AKaiser, MBrun, RRuiz-Pérez, LMJohansson, NGGonzález-Pacanowska, DGilbert, IH Deoxyuridine triphosphate nucleotidohydrolase as a potential antiparasitic drug target. J Med Chem48:5942-54 (2005) 
 
Deoxyuridine 5'-triphosphate nucleotidohydrolase
Name:Deoxyuridine 5'-triphosphate nucleotidohydrolase
Synonyms:dUTP pyrophosphatase
Type:Protein
Mol. Mass.:19574.43
Organism:Plasmodium falciparum
Description:Q8II92
Residue:173
BDBM50173535
NameBDBM50173535
TypeSmall organic molecule
Emp. Form.C27H24N2O4Si
Mol. Mass.468.576
SMILESO=c1ccn(C2OC(CO[Si](c3ccccc3)(c3ccccc3)c3ccccc3)C=C2)c(=O)[nH]1