Reaction Details
TargetPutative deoxyuridine triphosphatase
LigandBDBM50173563
Substrate/Competitorn/a
Meas. Tech.ChEMBL_320883 (CHEMBL884808)
Ki>1000000±n/a nM
Citation Nguyen, CKasinathan, GLeal-Cortijo, IMusso-Buendia, AKaiser, MBrun, RRuiz-Pérez, LMJohansson, NGGonzález-Pacanowska, DGilbert, IH Deoxyuridine triphosphate nucleotidohydrolase as a potential antiparasitic drug target. J Med Chem48:5942-54 (2005) 
 
Putative deoxyuridine triphosphatase
Name:Putative deoxyuridine triphosphatase
Type:PROTEIN
Mol. Mass.:30347.26
Organism:Leishmania major
Description:ChEMBL_320883
Residue:268
BDBM50173563
NameBDBM50173563
Synonyms:1-{4-Fluoro-5-[(trityl-amino)-methyl]-tetrahydro-furan-2-yl}-1H-pyrimidine-2,4-dione | CHEMBL198660
TypeSmall organic molecule
Emp. Form.C28H26FN3O3
Mol. Mass.471.5227
SMILESFC1CC(OC1CNC(c1ccccc1)(c1ccccc1)c1ccccc1)n1ccc(=O)[nH]c1=O