Reaction Details
TargetAmyloid-beta precursor protein
LigandBDBM50173640
Substrate/Competitorn/a
Meas. Tech.ChEMBL_320894 (CHEMBL872393)
Ki 1.1±n/a nM
Citation Zhang, WOya, SKung, MPHou, CMaier, DLKung, HF F-18 stilbenes as PET imaging agents for detecting beta-amyloid plaques in the brain. J Med Chem48:5980-8 (2005) 
 
Amyloid-beta precursor protein
Name:Amyloid-beta precursor protein
Type:Single-pass type I membrane protein
Mol. Mass.:86890.41
Organism:Homo sapiens (Human)
Description:P05067
Residue:770
BDBM50173640
NameBDBM50173640
Synonyms:4-[(E)-2-(4-Dimethylamino-phenyl)-vinyl]-phenol | CHEMBL198598
TypeSmall organic molecule
Emp. Form.C16H17NO
Mol. Mass.239.3123
SMILESCN(C)c1ccc(\C=C\c2ccc(O)cc2)cc1