Reaction Details
TargetAmyloid-beta precursor protein
LigandBDBM50173647
Substrate/Competitorn/a
Meas. Tech.ChEMBL_320894 (CHEMBL872393)
Ki 1.2±n/a nM
Citation Zhang, WOya, SKung, MPHou, CMaier, DLKung, HF F-18 stilbenes as PET imaging agents for detecting beta-amyloid plaques in the brain. J Med Chem48:5980-8 (2005) 
 
Amyloid-beta precursor protein
Name:Amyloid-beta precursor protein
Type:Single-pass type I membrane protein
Mol. Mass.:86890.41
Organism:Homo sapiens (Human)
Description:P05067
Residue:770
BDBM50173647
NameBDBM50173647
Synonyms:(E)-4-(4-(methylamino)styryl)phenol 4-N-methylamino-4'-hydroxystilbene CHEMBL381642 [3H]-4-(4-(methylamino)styryl)phenol
TypeSmall organic molecule
Emp. Form.C15H15NO
Mol. Mass.225.2857
SMILESCNc1ccc(\C=C\c2ccc(O)cc2)cc1