Reaction Details
TargetAmyloid-beta precursor protein
LigandBDBM50173649
Substrate/Competitorn/a
Meas. Tech.ChEMBL_320894 (CHEMBL872393)
Ki 95±n/a nM
Citation Zhang, WOya, SKung, MPHou, CMaier, DLKung, HF F-18 stilbenes as PET imaging agents for detecting beta-amyloid plaques in the brain. J Med Chem48:5980-8 (2005) 
 
Amyloid-beta precursor protein
Name:Amyloid-beta precursor protein
Type:Single-pass type I membrane protein
Mol. Mass.:86890.41
Organism:Homo sapiens (Human)
Description:P05067
Residue:770
BDBM50173649
NameBDBM50173649
Synonyms:4-[(E)-2-(4-Amino-phenyl)-vinyl]-phenol Stilbene derivative, 1
TypeSmall organic molecule
Emp. Form.C14H13NO
Mol. Mass.211.2591
SMILESNc1ccc(\C=C\c2ccc(O)cc2)cc1