Reaction Details
TargetAmyloid-beta precursor protein
LigandBDBM50173650
Substrate/Competitorn/a
Meas. Tech.ChEMBL_320894 (CHEMBL872393)
Ki 59±n/a nM
Citation Zhang, WOya, SKung, MPHou, CMaier, DLKung, HF F-18 stilbenes as PET imaging agents for detecting beta-amyloid plaques in the brain. J Med Chem48:5980-8 (2005) 
 
Amyloid-beta precursor protein
Name:Amyloid-beta precursor protein
Type:Single-pass type I membrane protein
Mol. Mass.:86890.41
Organism:Homo sapiens (Human)
Description:P05067
Residue:770
BDBM50173650
NameBDBM50173650
Synonyms:(4-{(E)-2-[4-(2,2-Dimethyl-[1,3]dioxan-5-ylmethoxy)-phenyl]-vinyl}-phenyl)-dimethyl-amine | CHEMBL371066
TypeSmall organic molecule
Emp. Form.C23H29NO3
Mol. Mass.367.4813
SMILESCN(C)c1ccc(\C=C\c2ccc(OCC3COC(C)(C)OC3)cc2)cc1