Reaction Details
TargetH(+)-exporting diphosphatase
LigandBDBM12578
Substrate/Competitorn/a
Meas. Tech.ChEMBL_321446 (CHEMBL880254)
IC50 226700±n/a nM
Citation Kotsikorou, ESong, YChan, JMFaelens, STovian, ZBroderick, EBakalara, NDocampo, ROldfield, E Bisphosphonate inhibition of the exopolyphosphatase activity of the Trypanosoma brucei soluble vacuolar pyrophosphatase. J Med Chem48:6128-39 (2005) 
 
H(+)-exporting diphosphatase
Name:H(+)-exporting diphosphatase
Synonyms:Vacuolar-type proton translocating pyrophosphatase 1
Type:PROTEIN
Mol. Mass.:85914.14
Organism:Trypanosoma brucei
Description:ChEMBL_321446
Residue:826
BDBM12578
NameBDBM12578
TypeSmall organic molecule
Emp. Form.C5H10N2O7P2
Mol. Mass.272.0896
SMILESOC(Cn1ccnc1)(P(O)(O)=O)P(O)(O)=O