Reaction Details
TargetGlutamine synthetase
LigandBDBM50174522
Substrate/Competitorn/a
Meas. Tech.ChEMBL_320773 (CHEMBL884728)
Ki 13000±n/a nM
Citation Berlicki, LObojska, AForlani, GKafarski, P Design, synthesis, and activity of analogues of phosphinothricin as inhibitors of glutamine synthetase. J Med Chem48:6340-9 (2005) 
 
Glutamine synthetase
Name:Glutamine synthetase
Type:PROTEIN
Mol. Mass.:51891.08
Organism:Escherichia coli (strain K12)
Description:ChEMBL_321474
Residue:469
BDBM50174522
NameBDBM50174522
Synonyms:(S)-2-Amino-4-[(2-amino-ethyl)-hydroxy-phosphinoyl]-butyric acid; dihydrochloride | CHEMBL538331
TypeSmall organic molecule
Emp. Form.C6H15N2O4P
Mol. Mass.210.1681
SMILESN[C@@H](CCP(O)(O)CC=N)C(O)=O