Reaction Details
TargetCannabinoid receptor 2
LigandBDBM50174545
Substrate/Competitorn/a
Meas. Tech.ChEMBL_320852 (CHEMBL884777)
Ki 9600±n/a nM
Citation Deng, HGifford, ANZvonok, AMCui, GLi, XFan, PDeschamps, JRFlippen-Anderson, JLGatley, SJMakriyannis, A Potent cannabinergic indole analogues as radioiodinatable brain imaging agents for the CB1 cannabinoid receptor. J Med Chem48:6386-92 (2005) 
 
Cannabinoid receptor 2
Name:Cannabinoid receptor 2
Type:Enzyme Catalytic Domain
Mol. Mass.:38220.43
Organism:MOUSE
Description:P47936
Residue:347
BDBM50174545
NameBDBM50174545
Synonyms:(3-Iodo-phenyl)-[2-methyl-1-(1-methyl-piperidin-2-ylmethyl)-1H-indol-3-yl]-methanone | CHEMBL197257
TypeSmall organic molecule
Emp. Form.C23H25IN2O
Mol. Mass.472.3619
SMILESCN1CCCCC1Cn1c(C)c(C(=O)c2cccc(I)c2)c2ccccc12