Reaction Details
TargetCannabinoid receptor 1
LigandBDBM50172545
Substrate/Competitorn/a
Meas. Tech.ChEMBL_320890 (CHEMBL872389)
Ki 1.3±n/a nM
Citation Deng, HGifford, ANZvonok, AMCui, GLi, XFan, PDeschamps, JRFlippen-Anderson, JLGatley, SJMakriyannis, A Potent cannabinergic indole analogues as radioiodinatable brain imaging agents for the CB1 cannabinoid receptor. J Med Chem48:6386-92 (2005) 
 
Cannabinoid receptor 1
Name:Cannabinoid receptor 1
Type:Enzyme
Mol. Mass.:52842.52
Organism:Mus musculus (Mouse)
Description:P47746
Residue:473
BDBM50172545
NameBDBM50172545
Synonyms:(2-Iodo-phenyl)-[1-((S)-1-methyl-piperidin-2-ylmethyl)-1H-indol-3-yl]-methanone CHEMBL364266
TypeSmall organic molecule
Emp. Form.C22H23IN2O
Mol. Mass.458.3353
SMILESCN1CCCCC1Cn1cc(C(=O)c2ccccc2I)c2ccccc12