Reaction Details
TargetGuanine nucleotide-binding protein G(o) subunit alpha
LigandBDBM50174646
Substrate/Competitorn/a
Meas. Tech.ChEMBL_321106 (CHEMBL882872)
EC50 13300±n/a nM
Citation Manetti, DDi Cesare Mannelli, LDei, SGaleotti, NGhelardini, CRomanelli, MNScapecchi, STeodori, EPacini, ABartolini, AGualtieri, F Design, synthesis, and preliminary pharmacological evaluation of a set of small molecules that directly activate gi proteins. J Med Chem48:6491-503 (2005) 
 
Guanine nucleotide-binding protein G(o) subunit alpha
Name:Guanine nucleotide-binding protein G(o) subunit alpha
Type:PROTEIN
Mol. Mass.:40043.59
Organism:Homo sapiens (Human)
Description:ChEMBL_321106
Residue:354
BDBM50174646
NameBDBM50174646
Synonyms:CHEMBL536278 | Pentadecyl-piperidin-4-yl-amine; dihydrochloride
TypeSmall organic molecule
Emp. Form.C20H42N2
Mol. Mass.310.5609
1CCNCC1